BDBM50427127 CHEMBL2323442
SMILES CN1[C@@H]2C[C@H](OC(C)=O)[C@@H]1C[C@@H](C2)OC(=O)c1ccccc1[N+]([O-])=O
InChI Key InChIKey=FSGYKLAGSGORJN-VZAMPYOESA-N
Data  2 KI
  Tab Delimited (TSV)   2D SDfile   Computed 3D by Vconf -m prep SDfile
Find this compound or compounds like it in BindingDB:
Activity Spreadsheet -- Enzyme Inhibition Constant Data from BindingDB
Found 1 hit for monomerid = 50427127
TargetMuscarinic acetylcholine receptor M3(RAT)
Shanghai Jiao Tong University
Curated by ChEMBL
LigandPNGBDBM50427127(CHEMBL2323442)
Affinity DataKi:  3.70E+3nM. Assay description: Displacement of [3H]NMS from muscarinic M3 receptor in Sprague-Dawley rat submandibulary gland after 60 mins
In DepthDetails ArticlePubMed